{"text_format":"1","workbook":"xlsx","n_sheets":6,"sheets":["Cover","Cashflow","Summary","Standard chart of accounts","DairyBase Import","Working"],"not_rendered":{"charts":0,"images":7,"macros":1,"external_links":0,"defined_names":51,"comments":1,"pivot_tables":0},"unopened":[],"bounds":{"document_bytes":16777216,"sheet_cells":100000,"rows_first":2000,"rows_last":500,"rows_between":2000,"halvings":0,"cell_chars":16384,"cell_head_chars":4096},"cells_cut":0,"cells_raw":0,"read":"whole","date_system":"1900"}

{"sheet":"Cover","index":0,"n_rows":0,"n_cols":0,"rows_kept":0,"cut":false,"hidden":false,"merged":[]}

{"sheet":"Cashflow","index":1,"n_rows":91,"n_cols":24,"rows_kept":91,"cut":false,"hidden":false,"merged":[[34,2,34,3],[60,1,60,2],[62,1,62,2],[90,0,90,17]]}
[null,null,null,null,null,"Year",null,null,null,null,null,null,null,null,null,null,null,null,"DairyBase"]
[null,null,null,null,null,2017,null,null,null,null,null,null,null,null,null,null,null,null,"Cash Report"]
[]
[null,null,null,null,"Annual","Month","Month","Month","Month","Month","Month","Month","Month","Month","Month","Month","Month","Annual","Month"]
[null,null,null,null,{"$f":"YEAR(E15)","v":2017},{"$f":"YEAR(F15)","v":2017},2017,2017,2017,2017,2017,2018,2018,2018,2018,2018,2018,{"$f":"Q5","v":2018},2016]
[null,null,null,null,{"$f":"IF(E8<=6,E5-1,E5)","v":2016},{"$f":"IF(F8<=6,F5-1,F5)","v":2017},{"$f":"IF(G8<=6,G5-1,G5)","v":2017},2017,2017,2017,2017,2017,2017,2017,2017,2017,2017,{"$f":"Q6","v":2017},2016]
[null,null,null,null,{"$f":"VLOOKUP(E8,Quarters,2,FALSE)","v":{"$error":"#NAME?"}},{"$f":"VLOOKUP(F8,Quarters,2,FALSE)","v":{"$error":"#NAME?"}},{"$error":"#NAME?"},{"$error":"#NAME?"},{"$error":"#NAME?"},{"$error":"#NAME?"},{"$error":"#NAME?"},{"$error":"#NAME?"},{"$error":"#NAME?"},{"$error":"#NAME?"},{"$error":"#NAME?"},{"$error":"#NAME?"},{"$error":"#NAME?"},null,1]
[null,null,null,null,{"$f":"MONTH(E15)","v":6},{"$f":"MONTH(F15)","v":7},8,9,10,11,12,1,2,3,4,5,6,null,7]
[null,null,null,null,{"$f":"DAY(DATE(YEAR(E15),MONTH(E15)+1,1)-1)","v":30},{"$f":"DAY(DATE(YEAR(F15),MONTH(F15)+1,1)-1)","v":31},31,30,31,30,31,31,28,31,30,31,30,365,31]
[null,null,null,null,{"$f":"TRIM(TEXT(E5,\"####\"))&TRIM(TEXT(E8,\"0#\"))","v":"201706"},{"$f":"TRIM(TEXT(F5,\"####\"))&TRIM(TEXT(F8,\"0#\"))","v":"201707"},"201708","201709","201710","201711","201712","201801","201802","201803","201804","201805","201806",null,"201607"]
[null,null,null,null,{"$f":"E16","v":"Budget"},{"$f":"F16","v":0},0,0,0,0,0,0,0,0,0,0,0,{"$f":"R16","v":"Budget"},"Budget"]
[]
[]
[null,null,null,null,{"$f":"F2","v":2017},{"$f":"YEAR(F15)","v":2017},{"$f":"YEAR(G15)","v":2017},2017,2017,2017,2017,{"$f":"YEAR(L15)","v":2018},2018,2018,2018,2018,2018,{"$f":"TRIM(TEXT(R6,\"####\")) & \"/\" & RIGHT(TRIM(TEXT(R6+1,\"####\")),2)","v":"2017/18"}]
[null,null,null,null,{"$f":"DATEVALUE(\"15/06/\"&TRIM(TEXT($E$14,\"####\")))","v":"2017-06-15"},{"$f":"DATEVALUE(\"15/\"&TRIM(TEXT(MONTH(E15)+1,\"##\"))&\"/\"&TRIM(TEXT(YEAR(E15),\"####\")))","v":"2017-07-15"},"2017-08-15","2017-09-15","2017-10-15","2017-11-15","2017-12-15",{"$f":"DATEVALUE(\"15/01/\"&TRIM(TEXT(YEAR(K15)+1,\"####\")))","v":"2018-01-15"},{"$f":"DATEVALUE(\"15/\"&TRIM(TEXT(MONTH(L15)+1,\"##\"))&\"/\"&TRIM(TEXT(YEAR(L15),\"####\")))","v":"2018-02-15"},{"$f":"DATEVALUE(\"15/\"&TRIM(TEXT(MONTH(M15)+1,\"##\"))&\"/\"&TRIM(TEXT(YEAR(M15),\"####\")))","v":"2018-03-15"},{"$f":"DATEVALUE(\"15/\"&TRIM(TEXT(MONTH(N15)+1,\"##\"))&\"/\"&TRIM(TEXT(YEAR(N15),\"####\")))","v":"2018-04-15"},{"$f":"DATEVALUE(\"15/\"&TRIM(TEXT(MONTH(O15)+1,\"##\"))&\"/\"&TRIM(TEXT(YEAR(O15),\"####\")))","v":"2018-05-15"},{"$f":"DATEVALUE(\"15/\"&TRIM(TEXT(MONTH(P15)+1,\"##\"))&\"/\"&TRIM(TEXT(YEAR(P15),\"####\")))","v":"2018-06-15"},"Annual"]
[null,null,null,null,"Budget",null,null,null,null,null,null,null,null,null,null,null,null,"Budget"]
[null,{"$f":"GetVersion()","v":{"$error":"#NAME?"}}]
[]
[null,"Milk income (Current year)",null,null,null,null,null,null,null,null,null,null,null,null,null,null,null,{"$f":"SUM(F19,G19,H19,I19,J19,K19,L19,M19,N19,O19,P19,Q19)","v":0},{"$f":"IF(ISNUMBER('DairyBase Import'!B19),'DairyBase Import'!B19,\"\")","v":846454}]
[null,"Milk income (Retrospective/Step ups)",null,null,null,null,null,null,null,null,null,null,null,null,null,null,null,0,null,null,null,null,null," "]
[null,"Livestock Sales",null,null,null,null,null,null,null,null,null,null,null,null,null,null,null,0,{"$f":"IF(ISNUMBER('DairyBase Import'!B21),'DairyBase Import'!B21,\"\")","v":45000}]
[null,"Feed and water sales",null,null,null,null,null,null,null,null,null,null,null,null,null,null,null,0,{"$f":"IF(ISNUMBER('DairyBase Import'!B22),'DairyBase Import'!B22,\"\")","v":0}]
[null,"Other farm income",null,null,null,null,null,null,null,null,null,null,null,null,null,null,null,0,{"$f":"IF(ISNUMBER('DairyBase Import'!B23),'DairyBase Import'!B23,\"\")","v":11000}]
[null,"TOTAL CASH INCOME",null,null,null,{"$f":"SUM(F19:F23)","v":0},0,0,0,0,0,0,0,0,0,0,0,0,{"$f":"IF(ISNUMBER('DairyBase Import'!B24),'DairyBase Import'!B24,\"\")","v":902454}]
[]
[null,"AI and herd test ",null,null,null,null,null,null,null,null,null,null,null,null,null,null,null,{"$f":"SUM(F26,G26,H26,I26,J26,K26,L26,M26,N26,O26,P26,Q26)","v":0},{"$f":"IF(ISNUMBER('DairyBase Import'!B26),'DairyBase Import'!B26,\"\")","v":11066}]
[null,"Animal health",null,null,null,null,null,null,null,null,null,null,null,null,null,null,null,0,{"$f":"IF(ISNUMBER('DairyBase Import'!B27),'DairyBase Import'!B27,\"\")","v":16687}]
[null,"Calf rearing",null,null,null,null,null,null,null,null,null,null,null,null,null,null,null,0,{"$f":"IF(ISNUMBER('DairyBase Import'!B28),'DairyBase Import'!B28,\"\")","v":3146}]
[null,"Other herd costs",null,null,null,null,null,null,null,null,null,null,null,null,null,null,null,0,{"$f":"IF(ISNUMBER('DairyBase Import'!B29),'DairyBase Import'!B29,\"\")","v":""}]
[null,"Total herd costs",null,null,null,{"$f":"F26+F27+F28","v":0},0,0,0,0,0,0,0,0,0,0,0,0,{"$f":"IF(ISNUMBER('DairyBase Import'!B30),'DairyBase Import'!B30,\"\")","v":30899}]
{"$rows_left_out":62}
{"sheet":"Summary","index":2,"n_rows":97,"n_cols":20,"rows_kept":97,"cut":false,"hidden":false,"merged":[[72,1,72,2],[74,1,74,2],[13,1,13,2]]}
[]
[null,null,null,null,null,null,null,null,null,null,null,null,null,null,"Values imported from the DairyBase report file"]
[]
[]
[]
[]
[]
[]
[]
[]
[]
[]
[]
[null,"SUMMARY",null,null,null,null,"Milk solids","Cows","% Income","Milking area","Total area",null,null,null,null,"Milksolids","Cows","% Income","Milking area","Total area"]
[null,null,null,null,null,null,"(kg)",null,null,"(ha)","(ha)",null,null,null,null,"(kg)",null,null,"(ha)","(ha)"]
[null,null,null,null,null,null,{"$f":"E20","v":0},{"$f":"E21","v":0},null,null,null,null,null,null,null,{"$f":"N20","v":120475.3662},{"$f":"N21","v":260},null,{"$f":"IF(ISNUMBER('DairyBase Import'!B8),'DairyBase Import'!B8,\"\")","v":110},{"$f":"IF(ISNUMBER('DairyBase Import'!B9),'DairyBase Import'!B9,\"\")","v":137}]
[]
[null,"MILK PRODUCTION"]
[null,"Milk production - litres (l)",null,null,null,null,null,{"$f":"IF(H16>0,E19/H16,0)","v":0},null,{"$f":"IF(J16>0,E19/J16,0)","v":0},{"$f":"IF(K16>0,E19/K16,0)","v":0},null,null,{"$f":"IF(ISNUMBER('DairyBase Import'!B4),'DairyBase Import'!B4,\"\")","v":1504062},null,null,{"$f":"IF(Q16>0,N19/Q16,0)","v":5784.8538461538465},null,{"$f":"IF(S16>0,N19/S16,0)","v":13673.290909090909},{"$f":"IF(T16>0,N19/T16,0)","v":10978.554744525547}]
[null,"Milk production - milk solids (kg)",null,null,{"$f":"E19*(E22+E23)","v":0},null,{"$f":"IF(G16>0,1/(E19/G16),0)","v":0},{"$f":"IF(H$16>0,$E20/H$16,0)","v":0},null,{"$f":"IF(J$16>0,$E20/J$16,0)","v":0},{"$f":"IF(K$16>0,$E20/K$16,0)","v":0},null,null,{"$f":"N19*(N22+N23)","v":120475.3662},null,{"$f":"IF(P16>0,1/(N19/P16),0)","v":8.0100000000000005E-2},{"$f":"IF(Q$16>0,$N20/Q$16,0)","v":463.3667930769231},null,{"$f":"IF(S$16>0,$N20/S$16,0)","v":1095.2306018181819},{"$f":"IF(T$16>0,$N20/T$16,0)","v":879.38223503649635}]
[null,"Cows",null,null,null,null,null,null,null,null,null,null,null,{"$f":"IF(ISNUMBER('DairyBase Import'!B5),'DairyBase Import'!B5,\"\")","v":260}]
[null,"Butterfat (% m/v)",null,null,null,null,null,null,null,null,null,null,null,{"$f":"IF(ISNUMBER('DairyBase Import'!B6),'DairyBase Import'!B6,\"\")","v":4.5400000000000003E-2}]
[null,"Protein (% m/v)",null,null,null,null,null,null,null,null,null,null,null,{"$f":"IF(ISNUMBER('DairyBase Import'!B7),'DairyBase Import'!B7,\"\")","v":3.4700000000000002E-2}]
[null,"Milk payment equivilent ($/kg MS)",null,null,{"$f":"IF(E20>0,E27/E20,0)","v":0},null,null,null,null,null,null,null,null,{"$f":"IF(N20>0,E27/N20,)","v":0}]
[null,"Milk payment (cpl)",null,null,{"$f":"IF(E19>0,E27*100/E19,0)","v":0},null,null,null,null,null,null,null,null,{"$f":"IF(N19>0,E27*100/N19,)","v":0}]
[]
[null,"Milk income (Current year)",null,null,{"$f":"Cashflow!R19","v":0},null,{"$f":"IF(G$16>0,$E27/G$16,0)","v":0},0,{"$f":"IF(E$32>0,$E27/E$32,0)","v":0},{"$f":"IF(J$16>0,$E27/J$16,0)","v":0},{"$f":"IF(K$16>0,$E27/K$16,0)","v":0}]
[null,"Milk income (Retrospective/Step ups)",null,null,{"$f":"Cashflow!R20","v":0},null,0,0,0,{"$f":"IF(J$16>0,$E28/J$16,0)","v":0},0]
[null,"Livestock sales",null,null,{"$f":"Cashflow!R21","v":0},null,0,0,0,0,0]
[null,"Feed and water sales",null,null,{"$f":"Cashflow!R22","v":0},null,0,0,0,0,0]
{"$rows_left_out":68}
{"sheet":"Standard chart of accounts","index":3,"n_rows":0,"n_cols":0,"rows_kept":0,"cut":false,"hidden":false,"merged":[]}

{"sheet":"DairyBase Import","index":4,"n_rows":229,"n_cols":40,"rows_kept":229,"cut":false,"hidden":true,"merged":[[4,38,4,39],[5,38,5,39],[12,38,12,39],[4,33,4,34],[5,33,5,34],[10,33,10,34],[10,18,10,19],[10,23,10,24],[10,28,10,29],[4,18,4,19],[4,23,4,24],[4,28,4,29],[5,18,5,19],[5,23,5,24],[5,28,5,29]]}
["Last Import Format:",1,null,"Ranges",null,"Ranges 1",null,"Ranges 2",null,"Ranges 3",null,"Ranges 4",null,"Ranges 5",null,null,null,"DairyBase Farm Data Output Report",null,"Version 2.8 April 6 2016",null,null,"DairyBase Farm Data Output Report",null,"Version 2.10 February 2 2017",null,null,"DairyBase Farm Data Output Report",null,"Version 3.5 May 24 2017",null,null,"DairyBase Farm Data Output Report",null,"Version 3.6 December 1 2017",null,null,"DairyBase Farm Data Output Report",null,"Version 3.7 April 23 2018"]
[null,null,null,"R1","R2","R1","R2","R1","R2","R1","R2","R1","R2","R1","R2"]
["Summary",null,null,null,null,null,null,null,null,null,null,null,null,null,null,null,null,"Farm Dataset Details",null,null,null,null,"Farm Dataset Details",null,null,null,null,"Farm Dataset Details",null,null,null,null,"Farm Dataset Details",null,null,null,null,"Farm Dataset Details"]
["Milk production (litres)",{"$f":"IF(E4=0,INDIRECT(D4),SUM(INDIRECT(D4),INDIRECT(E4)))","v":1504062},null,{"$f":"OFFSET(D4,0,$B$1*2)","v":"T26"},0,"T26",null,"Y26",null,"AD26",null,"AI62",null,"AN64"]
["Cows milked",260,null,"T20",0,"T20",null,"Y20",null,"AD20",null,"AI56",null,"AN58",null,null,null,"Name","Example Farm 13/14",null,null,null,"Name","DR 300 cows",null,null,null,"Name","DR 260 cows",null,null,null,"Name","DR 260 cows",null,null,null,"Name","Default 1"]
["Fat %",4.5400000000000003E-2,null,"T30",0,"T30",null,"Y30",null,"AD30",null,"AI66",null,"AN68",null,null,null,"Description",null,null,null,null,"Description",null,null,null,null,"Description",null,null,null,null,"Description",null,null,null,null,"Description"]
["Protein %",3.4700000000000002E-2,null,"T31",0,"T31",null,"Y31",null,"AD31",null,"AI67",null,"AN69",null,null,null,"DairyBase Farm Id","DA0001",null,null,null,"DairyBase Farm Id","DA0001",null,null,null,"DairyBase Farm Id","DA0001",null,null,null,"DairyBase Farm Id","DA0001",null,null,null,"DairyBase Farm Id","DA0001"]
["Milking area (ha)",110,null,"T16",0,"T16",null,"Y16",null,"AD16",null,"AI52",null,"AN54",null,null,null,"Financial Year","13/14",null,null,null,"Financial Year","16/17",null,null,null,"Financial Year","16/17",null,null,null,"Financial Year","16/17",null,null,null,"Region","Gippsland"]
["Total area (ha)",137,null,"T15",0,"T15",null,"Y15",null,"AD15",null,"AI51",null,"AN53",null,null,null,"Privacy Setting","Public Access",null,null,null,"Privacy Setting","Group Comparison",null,null,null,"Privacy Setting","Group Comparison",null,null,null,"Privacy Setting","Group Comparison",null,null,null,"State"]
[null,null,null,null,null,null,null,null,null,null,null,null,null,null,null,null,null,"Dataset Type","Created Scenario",null,null,null,"Dataset Type","Created Scenario",null,null,null,"Dataset Type","Created Scenario",null,null,null,"Dataset Type","Created Scenario",null,null,null,"Financial Year","17/18"]
[null,null,null,null,null,null,null,null,null,null,null,null,null,null,null,null,null,"Dataset Notes",null,null,null,null,"Dataset Notes",null,null,null,null,"Dataset Notes",null,null,null,null,"Dataset Notes",null,null,null,null,"Privacy Setting","Group Comparison"]
[null,null,null,null,null,null,null,null,null,null,null,null,null,null,null,null,null,null,null,null,null,null,null,null,null,null,null,null,null,null,null,null,null,null,null,null,null,"Dataset Type","Created Scenario"]
[null,null,null,null,null,null,null,null,null,null,null,null,null,null,null,null,null,"Physical Report",null,null,null,null,"Physical Report",null,null,null,null,"Physical Report",null,null,null,null,"Farm Business Summary",null,null,null,null,"Dataset Notes"]
[null,null,null,null,null,null,null,null,null,null,null,null,null,null,null,null,null,"Farm Area",null,null,null,null,"Farm Area",null,null,null,null,"Farm Area",null,null,null,null,"Physical Parameters"]
[null,null,null,null,null,null,null,null,null,null,null,null,null,null,null,null,null,"Usable Area","ha",137,null,null,"Usable Area","ha",150,null,null,"Usable Area","ha",150,null,null,"Usable Area","ha",150,null,null,"Farm Business Summary"]
[null,null,null,null,null,null,null,null,null,null,null,null,null,null,null,null,null,"Milking Area","ha",110,null,null,"Milking Area","ha",100,null,null,"Milking Area","ha",100,null,null,"Milking Area","ha",100,null,null,"Physical Parameters"]
[null,null,null,null,null,null,null,null,null,null,null,null,null,null,null,null,null,"Leased Area","ha",72,null,null,"Leased Area","ha",0,null,null,"Leased Area","ha",0,null,null,"Cows Milked","Number",260,null,null,"Usable Area","ha",137]
[null,null,null,null,null,null,null,null,null,null,null,null,null,null,null,null,null,"Irrigated Area","ha",10,null,null,"Irrigated Area","ha",0,null,null,"Irrigated Area","ha",0,null,null,"Annual Stocking Rate","Milking cows / Milking ha",2.6,null,null,"Milking Area","ha",110]
["Milk income (Current year)",{"$f":"IF(E19=0,INDIRECT(D19),SUM(INDIRECT(D19),INDIRECT(E19)))","v":846454},null,{"$f":"OFFSET(D19,0,$B$1*2)","v":"T119"},{"$f":"OFFSET(E19,0,$B$1*2)","v":0},"T119",null,"Y119",null,"AD121",null,"AI106",null,"AN111",null,null,null,"Livestock",null,null,null,null,"Livestock",null,null,null,null,"Livestock",null,null,null,null,"Milk Production - Litres","Total Litres",1768000,null,null,"Cows Milked","Number",177.91666666666666]
["Milk income (Retrospective/Step ups)",null,null,null,null,null,null,null,null,null,null,null,null,null,null,null,null,"Cows Milked","Number",260,null,null,"Cows Milked","Number",300,null,null,"Cows Milked","Number",260,null,null,"Milk Production - Kg Milksolids","Total Milksolids",132600,null,null,"Annual Stocking Rate","Milking cows / Milking ha",1.6174242424242424]
["Livestock Sales",{"$f":"IF(E21=0,INDIRECT(D21),SUM(INDIRECT(D21),INDIRECT(E21)))","v":45000},null,{"$f":"OFFSET(D21,0,$B$1*2)","v":"T70"},0,"T70",null,"Y71",null,"AD71",null,"AI107",null,"AN112",null,null,null,"Annual Stocking Rate","Milking cows / Milking ha",2.3636363636363638,null,null,"Annual Stocking Rate","Milking cows / Milking ha",3,null,null,"Annual Stocking Rate","Milking cows / Milking ha",2.6,null,null,"Homegrown Feed - Milking Area","t DM / Milking ha",9.1133174114090654,null,null,"Milk Production - Litres","Total Litres",1504062]
["Feed and water sales",0,null,"T71",0,"T71",null,"Y72",null,"AD72","AD73","AI108","AI109","AN113","AN114",null,null,"Annual Stocking Rate","Milking cows / Usable ha",1.8978102189781021,null,null,"Annual Stocking Rate","Milking cows / Usable ha",2,null,null,"Annual Stocking Rate","Milking cows / Usable ha",1.7333333333333334,null,null,"Homegrown Feed - Usable Area","t DM / Usable ha",8.3287712767048205,null,null,"Milk Production - Kg Milksolids","Total Milksolids",120522]
["Other farm income",11000,null,"T72",0,"T72",null,"Y73",null,"AD74",null,"AI110",null,"AN115",null,null,null,"Cow Liveweight","kgs  ",520,null,null,"Cow Liveweight","kgs  ",550,null,null,"Cow Liveweight","kgs  ",550,null,null,"Proportion of Homegrown Feed","% of Diet",0.67868059459144214,null,null,"Homegrown Feed - Milking Area","t DM / Milking ha",9.5972068000418194]
["TOTAL CASH INCOME",902454,null,"T73",0,"T73",null,"Y74",null,"AD75",null,"AI111",null,"AN116",null,null,null,"Cow Liveweight per Hectare","kgs / Milking ha",1229.090909090909,null,null,"Cow Liveweight per Hectare","kgs / Milking ha",1650,null,null,"Cow Liveweight per Hectare","kgs / Milking ha",1430,null,null,"Cows per Labour Unit","Milking cows / FTE",100.3861003861004,null,null,"Homegrown Feed - Usable Area","t DM / Usable ha",10.082361517772934]
[null,null,null,null,null,null,null,null,null,null,null,null,null,null,null,null,null,"Milk Production",null,"Quantity",null,null,"Milk Production",null,"Quantity",null,null,"Milk Production",null,"Quantity",null,null,null,null,null,null,null,"Proportion of Homegrown Feed","% of Diet",0.83285103710148956]
["AI and herd test ",{"$f":"IF(E26=0,INDIRECT(D26),SUM(INDIRECT(D26),INDIRECT(E26)))","v":11066},null,{"$f":"OFFSET(D26,0,$B$1*2)","v":"T75"},0,"T75",null,"Y76",null,"AD77",null,"AI113",null,"AN118",null,null,null,"Litres","Litres",1504062,null,null,"Litres","Litres",2100000,null,null,"Litres","Litres",1768000,null,null,null,null,"Total",null,null,"Cows per Labour Unit","Milking cows / FTE",65.895061728395049]
["Animal health",16687,null,"T76",0,"T76",null,"Y77",null,"AD78",null,"AI114",null,"AN119",null,null,null,"Fat","kg",68264,null,null,"Fat","kg",90300,null,null,"Fat","kg",76024,null,null,"Cash",null,"($)"]
["Calf rearing",3146,null,"T77",0,"T77",null,"Y78",null,"AD79",null,"AI115",null,"AN120",null,null,null,"Protein","kg",52258,null,null,"Protein","kg",67200,null,null,"Protein","kg",56576,null,null,"Milk Income",null,737256,null,null,null,null,"Total"]
["Other herd costs",null,null,"T78",0,"T78",null,"Y79",null,"AD80",null,"AI116",null,"AN121",null,null,null,"Milksolids","kg",120522,null,null,"Milksolids","kg",157500,null,null,"Milksolids","kg",132600,null,null,"Total Farm Cash Income",null,779756,null,null,"Cash",null,"($)"]
["Total herd costs",30899,null,"T79",0,"T79",null,"Y80",null,"AD81",null,"AI117",null,"AN122",null,null,null,"Fat %","% w/v",4.5400000000000003E-2,null,null,"Fat %","% w/v",4.2999999999999997E-2,null,null,"Fat %","% w/v",4.2999999999999997E-2,null,null,"Total Farm Working Expenses",null,516693,null,null,"Milk Income",null,636454]
{"$rows_left_out":200}
{"sheet":"Working","index":5,"n_rows":327,"n_cols":20,"rows_kept":327,"cut":false,"hidden":true,"merged":[]}
["Working",null,"Version:",0.46,"Date:","March 2016",null,null,null,null,"Store 1",null,"Store 2",null,"Store 3",null,"Defaults Detailed",null,"Defaults Intro"]
["Columns visible","Cashflow","MilkPrice","Wages","Stock","Feed",null,null,null,null,"Heights","Widths","Heights","Widths","Heights","Widths","Heights","Widths","Heights","Widths"]
["Budget",true,true,true,true,true,null,null,null,"Number",null,null,null,null,null,null,324,70,324,70]
["Actual",true,false,false,false,true,null,null,null,null,null,null,null,null,null,null,24,5.86,24,5.86]
["Differences",true,false,false,false,true,null,null,null,null,null,null,null,null,null,null,15.5,31,15.5,31]
["Months",true,true,true,true,true,null,null,null,null,null,null,null,null,null,null,15.5,20.57,15.5,20.57]
["Quarters",true,true,true,true,true,null,null,null,null,null,null,null,null,null,null,0,1.29,0,1.29]
["Annual",true,true,true,true,true,null,null,null,null,null,null,null,null,null,null,0,0,0,0]
[null,null,null,null,null,null,null,null,null,null,null,null,null,null,null,null,0,0,0,0]
["Purchased fodder check boxes",null,null,null,null,null,null,null,null,null,null,null,null,null,null,null,0,0,0,0]
["Fodder 1",false,null,null,null,null,null,null,null,null,null,null,null,null,null,null,0,0,0,0]
["Fodder 2",false,null,null,null,null,null,null,null,null,null,null,null,null,null,null,0,0,0,0]
["Fodder 3",false,null,null,null,null,null,null,null,null,null,null,null,null,null,null,0,0,0,0]
["Fodder 4",false,null,null,null,null,null,null,null,null,null,null,null,null,null,null,0,0,0,0]
["Fodder 5",false,null,null,null,null,null,null,null,null,null,null,null,null,null,null,0,0,0,0]
["Fodder 6",false,null,null,null,null,null,null,null,null,null,null,null,null,null,null,0,0,0,0]
[null,null,null,null,null,null,null,null,null,null,null,null,null,null,null,null,15.5,0,15.5,0]
["Purchased other check boxes",null,null,null,null,null,null,null,null,null,null,null,null,null,null,null,15.5,0,15.5,2.57]
["Other 1",false,null,null,null,null,null,null,null,null,null,null,null,null,null,null,15.5,0,15.5,10.71]
["Other 2",false,null,null,null,null,null,null,null,null,null,null,null,null,null,null,15.5,12,15.5,12]
["Other 3",false,null,null,null,null,null,null,null,null,null,null,null,null,null,null,15.5,12,15.5,0]
["Other 4",false,null,null,null,null,null,null,null,null,null,null,null,null,null,null,15.5,12,15.5,0]
[null,null,null,null,null,null,null,null,null,null,null,null,null,null,null,null,15.5,12,15.5,12]
["Wages",4,null,null,null,null,null,null,null,null,null,null,null,null,null,null,15.5,12,15.5,0]
[null,null,null,null,null,null,null,null,null,null,null,null,null,null,null,null,15.5,12,15.5,0]
["Interest paid","Compounding periods per year",null,null,null,null,null,null,null,null,null,null,null,null,null,null,15.5,12,15.5,12]
["Daily",1,365,null,null,null,null,null,null,null,null,null,null,null,null,null,15.5,12,15.5,0]
["Monthly",2,12,null,null,null,null,null,null,null,null,null,null,null,null,null,15.5,12,15.5,0]
["Quarterly",3,4,null,null,null,null,null,null,null,null,null,null,null,null,null,15.5,12,15.5,0]
["Half yearly",4,2,null,null,null,null,null,null,null,null,null,null,null,null,null,15.5,12,15.5,0]
{"$rows_left_out":297}